{"text_format":"1","workbook":"xlsx","n_sheets":15,"sheets":["Student Form","Sheet2","Other","pw","Reason","IBAN","Sort Code","Routing","Country","PoP","Financial Services Form","Sheet1","Sheet3","Sheet4","Sheet6"],"not_rendered":{"charts":0,"images":1,"macros":1,"external_links":2,"defined_names":17,"comments":0,"pivot_tables":0},"unopened":[],"bounds":{"document_bytes":16777216,"sheet_cells":100000,"rows_first":2000,"rows_last":500,"rows_between":2000,"halvings":0,"cell_chars":16384,"cell_head_chars":4096},"cells_cut":0,"cells_raw":0,"read":"whole","date_system":"1900"}

{"sheet":"Student Form","index":0,"n_rows":107,"n_cols":19,"rows_kept":107,"cut":false,"hidden":false,"merged":[[106,4,106,9],[106,10,106,17],[69,4,69,17],[67,4,67,17],[65,4,65,17],[87,4,87,17],[84,4,85,17],[83,4,83,17],[81,4,81,17],[79,4,79,17],[77,4,77,17],[75,4,75,17],[73,4,73,17],[71,4,71,17],[76,4,76,12],[66,4,66,14],[68,4,68,12],[70,4,70,12],[105,4,105,17],[102,4,102,9],[102,10,102,17],[104,4,104,9],[104,10,104,17],[90,4,90,7],[49,4,50,17],[47,4,47,5],[47,6,47,10],[100,4,101,17],[98,4,98,17],[96,4,96,17],[91,4,91,17],[89,4,89,17],[99,4,99,6],[97,4,97,6],[97,7,97,12],[97,13,97,14],[97,15,97,17],[99,7,99,17],[95,4,95,7],[95,8,95,17],[86,8,86,17],[92,14,92,15],[48,4,48,17],[92,4,92,7],[92,8,92,13],[92,16,92,17],[93,4,94,17],[64,16,64,17],[103,4,103,17],[57,4,60,17],[61,4,61,17],[62,4,63,17],[64,4,64,14],[47,11,47,14],[47,15,47,17],[31,4,31,17],[33,4,33,17],[37,6,37,10],[37,11,37,14],[37,15,37,17],[38,6,38,10],[41,6,41,10],[40,6,40,10],[39,6,39,10],[42,6,42,10],[34,15,34,17],[36,11,36,14],[36,15,36,17],[38,11,38,14],[38,15,38,17],[34,6,34,10],[32,4,32,17],[25,13,25,17],[26,5,26,10],[9,4,9,17],[21,11,21,12],[22,11,22,12],[23,11,23,12],[21,13,21,17],[22,13,22,17],[23,13,23,17],[21,5,21,10],[22,5,22,10],[23,5,23,10],[11,4,11,17],[12,4,12,17],[34,4,34,5],[18,4,20,17],[36,6,36,10],[4,4,8,17],[10,4,10,17],[13,4,13,17],[35,6,35,10],[35,11,35,14],[35,15,35,17],[14,4,14,6],[15,4,15,6],[16,4,16,6],[17,4,17,6],[14,7,14,17],[15,7,15,17],[16,7,16,17],[17,7,17,17],[27,4,27,17],[24,5,24,10],[25,5,25,10],[34,11,34,14],[25,11,25,12],[28,4,28,7],[29,4,29,7],[30,4,30,7],[28,8,28,17],[29,8,29,17],[30,8,30,17],[43,4,43,17],[39,11,42,17],[86,4,86,7],[78,15,78,17],[80,15,80,17],[78,4,78,14],[80,4,80,14],[72,4,72,12],[74,4,74,12],[45,4,45,5],[45,6,45,17],[44,15,44,17],[44,4,44,5],[44,6,44,10],[44,11,44,14],[52,4,52,5],[51,4,51,5],[51,6,51,11],[46,4,46,8],[46,9,46,17],[66,16,66,17],[68,16,68,17],[70,16,70,17],[72,16,72,17],[74,16,74,17],[76,16,76,17],[90,8,90,17],[88,4,88,7],[88,8,88,17],[52,6,52,11],[51,12,51,15],[51,16,51,17],[52,12,52,15],[52,16,52,17],[54,4,54,5],[53,6,53,11],[53,16,53,17],[54,6,54,17],[53,12,53,15]]}
[]
[]
[]
[]
[null,null,null,null,"Student Refund Form"]
[]
[]
[]
[]
[null,null,null,null,"Is this a Foreign Payment?"]
[null,null,null,null,"This form should be completed by the student only and we would request that it is typed and is in block capital letters to avoid errors when processing your refund.  Please fill out all compulsory field (marked with *); in order to get your request processed in a timely manner. Please submit the form Via:"]
[null,null,null,null,"Online Enquiry Form"]
[]
[null,null,null,null,"Student Details"]
[null,null,null,null,"Student ID *"]
[null,null,null,null,"First Name *"]
[null,null,null,null,"Surname *"]
[null,null,null,null,"Address * (Please ensure your address details on myUniHub are correct.)"]
[null,null,null,null,"Beneficiary Details"]
[]
[]
[null,null,null,null,"Account Holder Name *",null,null,null,null,null,null,"Country *"]
[null,null,null,null,"Address Line 1 *",null,null,null,null,null,null,"Email Address *"]
[null,null,null,null,"Address Line 2",null,null,null,null,null,null,"Telephone"]
[null,null,null,null,"Address Line 3"]
[null,null,null,null,"Town/ City *"]
[null,null,null,null,"Post Code*"]
[null,null,null,null,"Refund Details"]
[null,null,null,null,"Reason for Refund"]
[null,null,null,null,"Original Payment Method"]
[null,null,null,null,"Payment Currency"]
[null,null,null,null,"Bank Details"]
[null,null,null,null,"If your card has expired, please fill in bank details below."]
[null,null,null,null,"Refunds of cheque and cash payments will be made by bank transfer. Card refunds will be made to the card on which the original payment was made.",null,null,null,null,null,null,null,null,null,null,null,null,null," "]
[null,null,null,null,"Country*",null,null,null,null,null,null,"UK Sort Code"]
[null,null,null,null,"Account Holder Name",null,null,null,null,null,null,"Bank Account Number*"]
[null,null,null,null,"Bank Name*",null,null,null,null,null,null,"UK Roll Number"]
[null,null,null,null,"IBAN Number ",null,{"$f":"IF(ISERROR(VLOOKUP(G35,IBAN!A:B,2,FALSE)),\"\",VLOOKUP(G35,IBAN!A:B,2,FALSE))","v":""},null,null,null,null,"Swift/ BIC Code* (8 or 11 digits)"]
[null,null,null,null,"Address Line 1*",null,{"$f":"IF(ISERROR(VLOOKUP(G35,Country!A:B,2,FALSE)),\"\",VLOOKUP(G35,Country!A:B,2,FALSE))","v":""},null,null,null,null,"Routing Number (US transfers Only)"]
[null,null,null,null,"Adress Line 2",null,{"$f":"IF(ISERROR(VLOOKUP(G35,Country!A:B,2,FALSE)),\"\",VLOOKUP(G35,Country!A:B,2,FALSE))","v":""}]
[null,null,null,null,"Address Line 3"]
[null,null,null,null,"City*",null,{"$f":"IF(ISERROR(VLOOKUP(G35,Country!A:B,2,FALSE)),\"\",VLOOKUP(G35,Country!A:B,2,FALSE))","v":""}]
[null,null,null,null,"Post Code*",null,{"$f":"IF(ISERROR(VLOOKUP(G35,Country!A:B,2,FALSE)),\"\",VLOOKUP(G35,Country!A:B,2,FALSE))","v":""}]
[null,null,null,null,"Pay Via Correspondent Bank Only"]
[null,null,null,null,"Bank Name",null,null,null,null,null,null,"C.Bank Swift Code (8 or 11 digits)"]
[null,null,null,null,"Purpose of Payment *: ",null,{"$f":"IF(ISERROR(VLOOKUP(G35,PoP!A:B,2,FALSE)),\"\",VLOOKUP(G35,PoP!A:B,2,FALSE))","v":""}]
[null,null,null,null,"Additional References (information for bank use)"]
[null,null,null,null,"Student Signature",null,null,null,null,null,null,"Date"]
[]
[null,null,null,null,"For use by Financial Services"]
[]
[null,null,null,null,"AMOUNT OF REFUND",null,null,null,null,null,null,null,"GENERAL LEDGER CODE"]
[null,null,null,null,"REQUESTOR SIGNATURE",null,null,null,null,null,null,null,"BUDGET HOLDER SIGNATURE"]
[null,null,null,null,"DATE",null,null,null,null,null,null,null,"DATE"]
[null,null,null,null,"LINK",null,"Online Enquiry Form"]
[]
[]
[null,null,null,null,"Student Refund Form"]
[]
[]
[]
[null,null,null,null,"For use by Financial Services Only"]
[null,null,null,null,"Initital checks to be made on receipt of refund request. If the form is not fully completed the student must be contracted by the person receiving the refund request form"]
[]
[null,null,null,null,"Student 's account is in credit and authenticity of the credit has been confirmed."]
[]
[null,null,null,null,"If a third party is to be refunded, the full name and address of the third party is given"]
[]
[null,null,null,null,"Funds paid by cheque are cleared"]
[]
[null,null,null,null,"For BACS payment, bank account detials are complete"]
[]
[null,null,null,null,"VISA refusal letter is attached where necessary"]
[]
[null,null,null,null,"Sponsorship letter has been received where appropriate"]
[]
[null,null,null,null,"All outstanding transactions are matched"]
[]
[null,null,null,null,"Where necessary amount offset against other outstanding charges"]
[]
[null,null,null,null,"Value of account credit/ refund",null,null,null,null,null,null,null,null,null,null,"£"]
[]
[null,null,null,null,"Checked By:",null,null,null,null,null,null,null,null,null,"Date:"]
[]
[null,null,null,null,"To be completed by Student Fee's & Finance"]
[]
[null,null,null,null,"Refund approved for payment"]
[]
[null,null,null,null,"If not approved, date returned"]
[]
[null,null,null,null,"If refund not approved, give reason for rejection: "]
[]
[null,null,null,null,"Refund athuorised by:",null,null,null,null,null,null,null,null,null,"Date Authorised:"]
[null,null,null,null,"MISIS Refunds"]
[]
[null,null,null,null,"Date BACS refund processed on MISIS"]
[]
[null,null,null,null,"Semester Code",null,null,null,null,null,null,null,null,"Detail code used"]
[]
[null,null,null,null,"Input by:"]
[]
[]
[null,null,null,null,"Date card refund processed on AIM"]
[]
[null,null,null,null,"Fund code",null,null,null,null,null,"AIM Receipt number"]
[]
[null,null,null,null,"Input by:"]

{"sheet":"Sheet2","index":1,"n_rows":17,"n_cols":1,"rows_kept":17,"cut":false,"hidden":true,"merged":[]}
["Tuition Fees"]
["Nursery"]
["Summer School"]
["Accomodation "]
["Other"]
[]
["Withdrawal"]
["Visa Refusal"]
["Sponsorship"]
["Accomodation Deposit"]
["Other Reason"]
[]
["Cheque"]
["Cash"]
["Credit/ Debit Card"]
["Bank Transfer"]
["Recurring Card Payment"]

{"sheet":"Other","index":2,"n_rows":1,"n_cols":2,"rows_kept":1,"cut":false,"hidden":true,"merged":[]}
["Other","Must be Filled"]

{"sheet":"pw","index":3,"n_rows":1,"n_cols":2,"rows_kept":1,"cut":false,"hidden":true,"merged":[]}
["pw","financeform"]

{"sheet":"Reason","index":4,"n_rows":4,"n_cols":2,"rows_kept":4,"cut":false,"hidden":true,"merged":[]}
["Withdrawal","Please enter Date"]
["Visa Refusal","Please attach Visa Refusal Letter"]
["Sponsorship","Please attach purchase order or sponsor letter"]
["Other Reason","Please Specify"]

{"sheet":"IBAN","index":5,"n_rows":94,"n_cols":2,"rows_kept":94,"cut":false,"hidden":true,"merged":[]}
["Albania","Must be Filled"]
["Andorra","Must be Filled"]
["Angola","Must be Filled"]
["Austria","Must be Filled"]
["Azerbaijan","Must be Filled"]
["Bahrain","Must be Filled"]
["Belgium","Must be Filled"]
["Benin","Must be Filled"]
["Bosnia & Herzegovina","Must be Filled"]
["British Virgin Islands","Must be Filled"]
["Bulgaria","Must be Filled"]
["Burkina Faso","Must be Filled"]
["Burundi","Must be Filled"]
["Cameroon","Must be Filled"]
["Cape Verde","Must be Filled"]
["Centra African Republic","Must be Filled"]
["Croatia","Must be Filled"]
["Cyprus","Must be Filled"]
["Congo","Must be Filled"]
["Costa Rica","Must be Filled"]
["Cote d'lvoire","Must be Filled"]
["Czech Republic","Must be Filled"]
["Denmark","Must be Filled"]
["Dominican Republic","Must be Filled"]
["Estonia","Must be Filled"]
["Faroe Islands","Must be Filled"]
["Finland","Must be Filled"]
["France","Must be Filled"]
["French Guiana","Must be Filled"]
["French Polynesia","Must be Filled"]
["Georgia","Must be Filled"]
["Germany","Must be Filled"]
["Gibraltar","Must be Filled"]
["Greece","Must be Filled"]
["Greenland","Must be Filled"]
["Guadeloupe","Must be Filled"]
["Guernsey C.I. (UK)","Must be Filled"]
["Guatemala","Must be Filled"]
["Guinea-Bissau","Must be Filled"]
["Hungary","Must be Filled"]
["Iceland","Must be Filled"]
["Ireland","Must be Filled"]
["Israel","Must be Filled"]
["Island of Man","Must be Filled"]
["Italy","Must be Filled"]
["Iran","Must be Filled"]
["Ivory Coast","Must be Filled"]
["Jersey C.I. (UK)","Must be Filled"]
["Jordan","Must be Filled"]
["Kazakhstan","Must be Filled"]
["Kuwait","Must be Filled"]
["Latvia","Must be Filled"]
["Liechenstein","Must be Filled"]
["Lithuania","Must be Filled"]
["Luxembourg","Must be Filled"]
["Lebanon","Must be Filled"]
["Macedonia","Must be Filled"]
["Madagascar","Must be Filled"]
["Mali","Must be Filled"]
["Malta","Must be Filled"]
["Martinique","Must be Filled"]
["Mauritania","Must be Filled"]
["Mauritius","Must be Filled"]
["Monaco","Must be Filled"]
["Montenegro","Must be Filled"]
["Moldova","Must be Filled"]
["Mozambique","Must be Filled"]
["Netherlands","Must be Filled"]
["New Caledonia","Must be Filled"]
["Niger","Must be Filled"]
["Norway","Must be Filled"]
["Pakistan","Must be Filled"]
["Palestine","Must be Filled"]
["Poland","Must be Filled"]
["Portugal","Must be Filled"]
["Qatar","Must be Filled"]
["Romania","Must be Filled"]
["Reunion","Must be Filled"]
["Saint-Pierre and Miquelon","Must be Filled"]
["San Marino","Must be Filled"]
["Sao Tome & Principe","Must be Filled"]
["Saudi Arabia","Must be Filled"]
["Serbia","Must be Filled"]
["Senegal","Must be Filled"]
["Slovak Republic","Must be Filled"]
["Slovenia","Must be Filled"]
["Spain","Must be Filled"]
["Sweden","Must be Filled"]
["Switzerland","Must be Filled"]
["Togo","Must be Filled"]
["Tunisia","Must be Filled"]
["Turkey","Must be Filled"]
["UAE","Must be Filled"]
["Walis and Futuna","Must be Filled"]

{"sheet":"Sort Code","index":6,"n_rows":1,"n_cols":2,"rows_kept":1,"cut":false,"hidden":true,"merged":[]}
["UK","Must be Filled"]

{"sheet":"Routing","index":7,"n_rows":1,"n_cols":2,"rows_kept":1,"cut":false,"hidden":true,"merged":[]}
["USA","Must be Filled"]

{"sheet":"Country","index":8,"n_rows":178,"n_cols":2,"rows_kept":178,"cut":false,"hidden":true,"merged":[]}
["Albania","Must be Filled"]
["Algeria","Must be Filled"]
["Andorra","Must be Filled"]
["Angola","Must be Filled"]
["Armenia","Must be Filled"]
["Aruba","Must be Filled"]
["Australia ","Must be Filled"]
["Austria ","Must be Filled"]
["Azerbaijan","Must be Filled"]
["Bahamas","Must be Filled"]
["Bahrain","Must be Filled"]
["Bangladesh","Must be Filled"]
["Barbados","Must be Filled"]
["Belgium","Must be Filled"]
["Belize","Must be Filled"]
["Benin","Must be Filled"]
["Bermuda","Must be Filled"]
["Bhutan","Must be Filled"]
["Bosnia & Herzegovina","Must be Filled"]
["Botswana ","Must be Filled"]
["Brazil","Must be Filled"]
["British Virgin Islands","Must be Filled"]
["Brunei","Must be Filled"]
["Bulgaria ","Must be Filled"]
["Burkina Faso","Must be Filled"]
["Burundi","Must be Filled"]
["Burundi","Must be Filled"]
["Cambodia","Must be Filled"]
["Cameroon","Must be Filled"]
["Cape Verde","Must be Filled"]
["Cape Verde Islands","Must be Filled"]
["Central African Republic","Must be Filled"]
["Chad","Must be Filled"]
["Chile","Must be Filled"]
["China","Must be Filled"]
["Colombia","Must be Filled"]
["Comoros","Must be Filled"]
["Congo","Must be Filled"]
["Costa Rica","Must be Filled"]
["Cote d'lvoire","Must be Filled"]
["Croatia","Must be Filled"]
["Cyprus","Must be Filled"]
["Czech Republic","Must be Filled"]
["Democratic Replublic of Congo","Must be Filled"]
["Denmark","Must be Filled"]
["Dijibouti","Must be Filled"]
["Dominican Republic","Must be Filled"]
["E.Caribbean","Must be Filled"]
["Egypt","Must be Filled"]
["El Salvador","Must be Filled"]
["Equatorial Guinea","Must be Filled"]
["Estonia ","Must be Filled"]
["Ethiopia","Must be Filled"]
["Falklands/ Malvinas","Must be Filled"]
["Faroe Islands","Must be Filled"]
["Finland","Must be Filled"]
["France ","Must be Filled"]
["French Guiana","Must be Filled"]
["French Polynesia","Must be Filled"]
["Gabon","Must be Filled"]
["Gambia","Must be Filled"]
["Georgia","Must be Filled"]
["Germany","Must be Filled"]
["Gibraltar","Must be Filled"]
["Greece","Must be Filled"]
["Greenland","Must be Filled"]
["Guadeloupe","Must be Filled"]
["Guatemala","Must be Filled"]
["Guernsey C.I. (UK)","Must be Filled"]
["Guinea","Must be Filled"]
["Guinea-Bissau","Must be Filled"]
["Guyana","Must be Filled"]
["Haiti","Must be Filled"]
["Honduras","Must be Filled"]
["Hong Kong ","Must be Filled"]
["Hungary","Must be Filled"]
["Iceland","Must be Filled"]
["India","Must be Filled"]
["Indonesia ","Must be Filled"]
["Iran","Must be Filled"]
["Ireland","Must be Filled"]
["Island of Man","Must be Filled"]
["Israel","Must be Filled"]
["Italy","Must be Filled"]
["Ivory Coast","Must be Filled"]
["Jamaica","Must be Filled"]
["Jersey C.I. (UK)","Must be Filled"]
["Jordan","Must be Filled"]
["Kazakhstan","Must be Filled"]
["Kenya","Must be Filled"]
["Korea","Must be Filled"]
["Kuwait","Must be Filled"]
["Kyrgystan","Must be Filled"]
["Laos","Must be Filled"]
["Latvia","Must be Filled"]
["Lebanon","Must be Filled"]
["Lesotho","Must be Filled"]
["Liechenstein","Must be Filled"]
["Lithuania","Must be Filled"]
["Luxembourg","Must be Filled"]
["Macau","Must be Filled"]
["Macedonia","Must be Filled"]
["Madagascar","Must be Filled"]
["Malaysia ","Must be Filled"]
["Maldives","Must be Filled"]
["Mali","Must be Filled"]
["Malta ","Must be Filled"]
["Martinique","Must be Filled"]
["Mauritania","Must be Filled"]
["Mauritius","Must be Filled"]
["Moldova","Must be Filled"]
["Monaco","Must be Filled"]
["Mongolia","Must be Filled"]
["Montenegro","Must be Filled"]
["Morocco","Must be Filled"]
["Mozambique","Must be Filled"]
["Namibia","Must be Filled"]
["Nepal","Must be Filled"]
["Netherland Antilles","Must be Filled"]
["Netherlands","Must be Filled"]
["New Caledonia","Must be Filled"]
["New Zealand ","Must be Filled"]
["Nicaragua","Must be Filled"]
["Niger","Must be Filled"]
["Nigeria ","Must be Filled"]
["Norway","Must be Filled"]
["Oman","Must be Filled"]
["Pakistan","Must be Filled"]
["Palestine","Must be Filled"]
["Panama","Must be Filled"]
["Paraguay","Must be Filled"]
["Peru","Must be Filled"]
["Poland","Must be Filled"]
["Portugal","Must be Filled"]
["Qatar","Must be Filled"]
["Republic of Congo","Must be Filled"]
["Republic of Macedonia","Must be Filled"]
["Reunion","Must be Filled"]
["Romania","Must be Filled"]
["Russia","Must be Filled"]
["Rwanda","Must be Filled"]
["Saint-Pierre and Miquelon","Must be Filled"]
["San Marino","Must be Filled"]
["Sao Tome & Principe","Must be Filled"]
["Saudi Arabia ","Must be Filled"]
["Senegal","Must be Filled"]
["Serbia","Must be Filled"]
["Seychelles","Must be Filled"]
["Slovak Republic","Must be Filled"]
["Slovakia ","Must be Filled"]
["Slovenia","Must be Filled"]
["Somalia","Must be Filled"]
["South Korea","Must be Filled"]
["Spain ","Must be Filled"]
["Sri Lanka ","Must be Filled"]
["St Helena","Must be Filled"]
["Suriname","Must be Filled"]
["Swaziland","Must be Filled"]
["Sweden ","Must be Filled"]
["Switzerland","Must be Filled"]
["Taiwan","Must be Filled"]
["Tanzania","Must be Filled"]
["Thailand ","Must be Filled"]
["Togo","Must be Filled"]
["Trinidad & Tobago","Must be Filled"]
["Tunisia","Must be Filled"]
["Turkey ","Must be Filled"]
["UAE ","Must be Filled"]
["UK","Must be Filled"]
["Ukraine","Must be Filled"]
["Uruguay","Must be Filled"]
["USA","Must be Filled"]
["Uzbekistan","Must be Filled"]
["Vietnam","Must be Filled"]
["Walis and Futuna","Must be Filled"]
["West Africa","Must be Filled"]
["Yemen","Must be Filled"]
["Zambia","Must be Filled"]

{"sheet":"PoP","index":9,"n_rows":106,"n_cols":2,"rows_kept":106,"cut":false,"hidden":true,"merged":[]}
["Albania","Must be Filled"]
["Algeria","Must be Filled"]
["Angola","Must be Filled"]
["Armenia","Must be Filled"]
["Aruba","Must be Filled"]
["Azerbaijan","Must be Filled"]
["Bahamas","Must be Filled"]
["Bangladesh","Must be Filled"]
["Barbados","Must be Filled"]
["Belize","Must be Filled"]
["Benin","Must be Filled"]
["Bermuda","Must be Filled"]
["Bhutan","Must be Filled"]
["Brazil","Must be Filled"]
["Brunei","Must be Filled"]
["Bulgaria","Must be Filled"]
["Burkina Faso","Must be Filled"]
["Burundi","Must be Filled"]
["Cambodia","Must be Filled"]
["Cameroon","Must be Filled"]
["Cape Verde Islands","Must be Filled"]
["Central African","Must be Filled"]
["Chad","Must be Filled"]
["Chile","Must be Filled"]
["China","Must be Filled"]
["Colombia","Must be Filled"]
["Comoros","Must be Filled"]
["Democratic Replublic of Congo","Must be Filled"]
["Republic of Congo","Must be Filled"]
["Costa Rica","Must be Filled"]
["Cote d'lvoire","Must be Filled"]
["Dijibouti","Must be Filled"]
["Dominican Republic","Must be Filled"]
["E.Caribbean","Must be Filled"]
["Egypt","Must be Filled"]
["El Salvador","Must be Filled"]
["Ethiopia","Must be Filled"]
["Falklands/ Malvinas","Must be Filled"]
["Gabon","Must be Filled"]
["Gambia","Must be Filled"]
["Georgia","Must be Filled"]
["Gibraltar","Must be Filled"]
["Guatemala","Must be Filled"]
["Guinea","Must be Filled"]
["Equatorial Guinea","Must be Filled"]
["Guyana","Must be Filled"]
["Haiti","Must be Filled"]
["Honduras","Must be Filled"]
["India","Must be Filled"]
["Indonesia","Must be Filled"]
["Jamaica","Must be Filled"]
["Jordan","Must be Filled"]
["Kenya","Must be Filled"]
["Kazakhstan","Must be Filled"]
["South Korea","Must be Filled"]
["Kyrgystan","Must be Filled"]
["Laos","Must be Filled"]
["Latvia","Must be Filled"]
["Lebanon","Must be Filled"]
["Lesotho","Must be Filled"]
["Macau","Must be Filled"]
["Republic of Macedonia","Must be Filled"]
["Madagascar","Must be Filled"]
["Malaysia","Must be Filled"]
["Maldives","Must be Filled"]
["Mali","Must be Filled"]
["Mauritania","Must be Filled"]
["Mauritius","Must be Filled"]
["Moldova","Must be Filled"]
["Mongolia","Must be Filled"]
["Morocco","Must be Filled"]
["Mozambique","Must be Filled"]
["Namibia","Must be Filled"]
["Nepal","Must be Filled"]
["Netherland Antilles","Must be Filled"]
["Nicaragua","Must be Filled"]
["Niger","Must be Filled"]
["Nigeria","Must be Filled"]
["Oman","Must be Filled"]
["Panama","Must be Filled"]
["Paraguay","Must be Filled"]
["Peru","Must be Filled"]
["Qatar","Must be Filled"]
["Romania","Must be Filled"]
["Russia","Must be Filled"]
["Rwanda","Must be Filled"]
["Sao Tome & Principe","Must be Filled"]
["Saudi Arabia","Must be Filled"]
["Senegal","Must be Filled"]
["Seychelles","Must be Filled"]
["Somalia","Must be Filled"]
["St Helena","Must be Filled"]
["Suriname","Must be Filled"]
["Swaziland","Must be Filled"]
["thailand ","Must be Filled"]
["Taiwan","Must be Filled"]
["Tanzania","Must be Filled"]
["Togo","Must be Filled"]
["Trinidad & Tobago","Must be Filled"]
["Ukraine","Must be Filled"]
["Uruguay","Must be Filled"]
["Uzbekistan","Must be Filled"]
["Vietnam","Must be Filled"]
["West Africa","Must be Filled"]
["Yemen","Must be Filled"]
["Zambia","Must be Filled"]

{"sheet":"Financial Services Form","index":10,"n_rows":55,"n_cols":12,"rows_kept":55,"cut":false,"hidden":true,"merged":[[0,0,3,13],[5,0,6,13],[11,0,11,8],[39,0,39,13],[48,0,48,13],[4,0,4,13],[7,0,7,10],[9,0,9,10],[13,0,13,8],[15,0,15,8],[17,0,17,8],[19,0,19,8],[21,0,21,9],[27,0,27,13]]}
["Student Refund Form"]
[]
[]
[]
["For use by Financial Services Only"]
["Initital checks to be made on receipt of refund request. If the form is not fully completed the student must be contracted by the person receiving the refund request form"]
[]
["Student 's account is in credit and authenticity of the credit has been confirmed."]
[]
["If a third party is to be refunded, the full name and address of the third party is given"]
[]
["Funds paid by cheque are cleared"]
[]
["For BACS payment, bank account detials are complete"]
[]
["VISA refusal letter is attached where necessary"]
[]
["Sponsorship letter has been received where appropriate"]
[]
["All outstanding transactions are matched"]
[]
["Where necessary amount offset against other outstanding charges",null,null,null,null,null,null,null,null,null,"£"]
[]
["Value of account credit/ refund",null,null,null,null,null,null,null,null,null,"£"]
[]
["Checked By:",null,null,null,null,null,null,null,null,null,"Date:"]
[]
["To be completed by Student Fee's & Finance"]
[]
["Refund approved for payment",null,null,null,null,null,null,null,null,null,null,"Y / N"]
[]
["If not approved, date returned"]
[]
["If refund not approved, give reason for rejection"]
[]
[]
[]
["Refund athuorised by:",null,null,null,null,null,null,null,null,null,"Date Authorised:"]
[]
["MISIS Refunds"]
[]
["Date BACS refund processed on MISIS"]
[]
["Semester Code",null,null,null,null,null,null,null,null,"Detail code used"]
[]
["Input by:"]
[]
[]
["IMS Refunds"]
[]
["Date card refund processed on IMS"]
[]
["Fund code",null,null,null,null,null,null,null,null,"IMS Receipt number"]
[]
["Input by:"]

{"sheet":"Sheet1","index":11,"n_rows":3,"n_cols":2,"rows_kept":3,"cut":false,"hidden":true,"merged":[]}
["Cheque","Must be Filled"]
["Cash","Must be Filled"]
["Bank Transfer","Must be Filled"]

{"sheet":"Sheet3","index":12,"n_rows":3,"n_cols":2,"rows_kept":3,"cut":false,"hidden":true,"merged":[]}
["Must be Filled","Must be Filled"]
["Must be Filled","Must be Filled"]
["Must be Filled","Must be Filled"]

{"sheet":"Sheet4","index":13,"n_rows":7,"n_cols":1,"rows_kept":7,"cut":false,"hidden":true,"merged":[]}
["Yes"]
["No"]
[]
[]
[]
["01 - MDX"]
["03- MUV"]

{"sheet":"Sheet6","index":14,"n_rows":1,"n_cols":2,"rows_kept":1,"cut":false,"hidden":true,"merged":[]}
["Yes","Must be Filled"]